{"text_format":"1","workbook":"xlsx","n_sheets":9,"sheets":["記入上の注意（必ずお読みください）","Sheet2","申込一覧","リレー","ﾘﾚｰDB","競技者","参加料","名前","Sheet1"],"not_rendered":{"charts":0,"images":2,"macros":1,"external_links":2,"defined_names":27,"comments":1,"pivot_tables":0},"unopened":[],"bounds":{"document_bytes":16777216,"sheet_cells":100000,"rows_first":2000,"rows_last":500,"rows_between":2000,"halvings":0,"cell_chars":16384,"cell_head_chars":4096},"cells_cut":0,"cells_raw":0,"read":"whole","date_system":"1900"}

{"sheet":"記入上の注意（必ずお読みください）","index":0,"n_rows":24,"n_cols":2,"rows_kept":24,"cut":false,"hidden":false,"merged":[[0,0,0,1]]}
["記入上の注意（必ずお読みください）"]
[]
["【1】","本大会専用の申込みファイルであることを確認してください。"]
[null,"　　　この申込みファイルは「第1回とくしま市中長距離記録会」です。"]
["【2】","申込ファイル上部の所属～種別を打ち込まないと、下部の個人種目等は明示されません。"]
["【3】","色のついたセルにのみ入力してください。"]
["【4】","例にならって記入してください。"]
[null,"各項目の先頭セルにあるコメントをよく読んで記入してくだい。"]
[null,"ナンバーの「－」ハイフンは省いて入力してください。"]
[]
[]
[]
[null,"※他のデータからコピーする場合は、「形式を選択して貼付→値」でお願いします。"]
[null,"※最高記録は数字のみ，トラックは1/100まで記入して下さい。"]
[]
{"$rows_left_out":10}
{"sheet":"Sheet2","index":1,"n_rows":3,"n_cols":11,"rows_kept":3,"cut":false,"hidden":true,"merged":[]}
["NO.","ﾅﾝﾊﾞｰ","氏　　名","ﾌﾘｶﾞﾅ","年","性","都道府県","種目１","最高記録","種目2","最高記録"]
[1,1234,"徳島　一男","ﾄｸｼﾏ　ｶｽﾞｵ",3,"男","徳島","一男_1500m",41234,"一男_5000m",151234]
[2,1234,"徳島　華子","ﾄｸｼﾏ　ﾊﾅｺ",2,"女","徳島","一女_1500m",51234,"一女_3000m",101234]

{"sheet":"申込一覧","index":2,"n_rows":99,"n_cols":18,"rows_kept":99,"cut":false,"hidden":false,"merged":[[7,2,7,7],[13,6,13,7],[13,3,13,5],[13,8,13,9],[12,3,12,5],[10,5,10,8],[15,6,15,7],[15,3,15,5],[14,3,14,5],[16,8,16,9],[14,6,14,7],[16,6,16,7],[16,3,16,5],[15,8,15,9],[14,8,14,9],[0,9,0,12],[12,6,12,7],[2,10,2,12],[4,0,4,11],[12,8,12,9],[8,0,8,1],[10,3,10,4],[10,0,10,1],[7,0,7,1],[5,0,5,11],[7,8,7,9],[8,5,8,7],[8,8,8,12],[10,10,10,12],[8,2,8,4],[0,3,0,8]]}
[null,null,1,"とくしま市中長距離記録会"]
[]
[null,null,null,null,null,null,null,null,null,null,{"$f":"lastsavetime()","v":"2025-01-25T13:58:10"}]
[]
["　徳島陸上競技協会長　殿"]
["　大会要項により，参加料を添えて標記大会に参加申し込みをいたします。"]
[]
["所 属 名",null,null,null,null,null,null,null,"所   属   長"]
["申込責任者",null,null,null,null,"緊急連絡先\n（申込者の携帯電話）"]
[]
["都道\n府県",null,null,"所属名略称",null,null,null,null,null,"種   別"]
[]
[null,null,null,"男子",null,null,"女子",null,"計",null,"1種目",{"$f":"IF(K11=\"\",\"\",INDEX(名前!$G$27:$G$35,MATCH(O13,名前!H27:H35,0)))","v":""},null,{"$f":"IF(K11=\"一般\",11,IF(K11=\"高校\",33,IF(K11=\"中学校\",55,IF(K11=\"小学校\",77,\"\"))))","v":""},{"$f":"IF(C11=\"\",\"\",IF(C11=\"徳　島\",\"KN\",\"KG\")&LEFT(K11,1))","v":""}]
[null,null,"参加人数",{"$f":"COUNTIF($F$20:$F$99,1)","v":0},null,null,{"$f":"COUNTIF($F$20:$F$99,2)","v":0},null,{"$f":"SUM(D14:H14)","v":0}]
[null,null,"個人種目数",{"$f":"COUNTIF($I$20:$I$99:$K$20:$K$99:$M$20:$M$99,\"*\"&\"男\"&\"*\")","v":0},null,null,{"$f":"COUNTIF($I$20:$I$99:$K$20:$K$99:$M$20:$M$99,\"*\"&\"女\"&\"*\")","v":0},null,{"$f":"SUM(D15:H15)","v":0}]
{"$rows_left_out":85}
{"sheet":"リレー","index":3,"n_rows":25,"n_cols":16,"rows_kept":25,"cut":false,"hidden":true,"merged":[[6,0,6,8],[0,0,0,8],[2,6,2,8],[4,0,4,8],[5,0,5,8]]}
["徳島強化記録会 兼 小学生強化大会　リレーエントリー"]
[]
[null,null,null,null,null,null,{"$f":"IF(申込一覧!F11=\"\",\"\",申込一覧!F11)","v":""}]
[]
["注１　選手の欄にナンバーカード（半角数字）を入力してください。"]
["注2　リレーのみの参加選手も【申込一覧】に入力してください。"]
["注3　同種目に複数チーム参加する場合はチーム欄に「 A，B，C，・・・・ 」等をリストより選択してください。"]
["注4　同種目に1チームの場合はチーム欄は空白でお願いします。"]
[]
["種目","チーム","最高記録","選手①","選手②","選手③","選手④","選手⑤","選手⑥"]
["女4×100mR","A",10091,1045,1047,1043,1044,null,null,null,{"$f":"IF(D11=\"\",\"\",IF(LEFT($A11,1)=\"男\",10000+D11,IF(LEFT($A11,1)=\"女\",20000+D11,\"\")))","v":21045},21047,21043,21044,"",""]
[null,null,null,null,null,null,null,null,null,null,{"$f":"IF(D12=\"\",\"\",IF(LEFT($A12,1)=\"男\",10000+D12,IF(LEFT($A12,1)=\"女\",20000+D12,\"\")))","v":""},{"$f":"IF(E12=\"\",\"\",IF(LEFT($A12,1)=\"男\",10000+E12,IF(LEFT($A12,1)=\"女\",20000+E12,\"\")))","v":""},{"$f":"IF(F12=\"\",\"\",IF(LEFT($A12,1)=\"男\",10000+F12,IF(LEFT($A12,1)=\"女\",20000+F12,\"\")))","v":""},{"$f":"IF(G12=\"\",\"\",IF(LEFT($A12,1)=\"男\",10000+G12,IF(LEFT($A12,1)=\"女\",20000+G12,\"\")))","v":""},{"$f":"IF(H12=\"\",\"\",IF(LEFT($A12,1)=\"男\",10000+H12,IF(LEFT($A12,1)=\"女\",20000+H12,\"\")))","v":""},{"$f":"IF(I12=\"\",\"\",IF(LEFT($A12,1)=\"男\",10000+I12,IF(LEFT($A12,1)=\"女\",20000+I12,\"\")))","v":""}]
[null,null,null,null,null,null,null,null,null,null,"","","","","",""]
[null,null,null,null,null,null,null,null,null,null,"","","","","",""]
[null,null,null,null,null,null,null,null,null,null,"","","","","",""]
{"$rows_left_out":11}
{"sheet":"ﾘﾚｰDB","index":4,"n_rows":30,"n_cols":12,"rows_kept":30,"cut":false,"hidden":true,"merged":[]}
[null,"DB","ZK","N1","N2","TM","S1","S2","S3","S4","S5","S6"]
[{"$f":"IF(リレー!A11=\"\",\"\",リレー!A11)","v":"女4×100mR"},{"$f":"IF(リレー!A11=\"\",\"\",申込一覧!$F$11)&IF(リレー!B11=\"\",\"\",リレー!B11)","v":"A"},null,{"$f":"IF(リレー!A11=\"\",\"\",申込一覧!$F$11)&IF(リレー!B11=\"\",\"\",リレー!B11)","v":"A"},null,{"$f":"IF(リレー!C11=\"\",\"\",リレー!C11)","v":10091},{"$f":"IF(リレー!D11=\"\",\"\",INDEX(競技者!$A$2:$A$81,MATCH(リレー!K11,競技者!$M$2:$M$81,0)))","v":{"$error":"#N/A"}},{"$f":"IF(リレー!E11=\"\",\"\",INDEX(競技者!$A$2:$A$81,MATCH(リレー!L11,競技者!$M$2:$M$81,0)))","v":{"$error":"#N/A"}},{"$f":"IF(リレー!F11=\"\",\"\",INDEX(競技者!$A$2:$A$81,MATCH(リレー!M11,競技者!$M$2:$M$81,0)))","v":{"$error":"#N/A"}},{"$f":"IF(リレー!G11=\"\",\"\",INDEX(競技者!$A$2:$A$81,MATCH(リレー!N11,競技者!$M$2:$M$81,0)))","v":{"$error":"#N/A"}},{"$f":"IF(リレー!H11=\"\",\"\",INDEX(競技者!$A$2:$A$81,MATCH(リレー!O11,競技者!$M$2:$M$81,0)))","v":""},{"$f":"IF(リレー!I11=\"\",\"\",INDEX(競技者!$A$2:$A$81,MATCH(リレー!P11,競技者!$M$2:$M$81,0)))","v":""}]
[{"$f":"IF(リレー!A12=\"\",\"\",リレー!A12)","v":""},{"$f":"IF(リレー!A12=\"\",\"\",申込一覧!$F$11)&IF(リレー!B12=\"\",\"\",リレー!B12)","v":""},null,{"$f":"IF(リレー!A12=\"\",\"\",申込一覧!$F$11)&IF(リレー!B12=\"\",\"\",リレー!B12)","v":""},null,{"$f":"IF(リレー!C12=\"\",\"\",リレー!C12)","v":""},{"$f":"IF(リレー!D12=\"\",\"\",INDEX(競技者!$A$2:$A$81,MATCH(リレー!K12,競技者!$M$2:$M$81,0)))","v":""},{"$f":"IF(リレー!E12=\"\",\"\",INDEX(競技者!$A$2:$A$81,MATCH(リレー!L12,競技者!$M$2:$M$81,0)))","v":""},{"$f":"IF(リレー!F12=\"\",\"\",INDEX(競技者!$A$2:$A$81,MATCH(リレー!M12,競技者!$M$2:$M$81,0)))","v":""},{"$f":"IF(リレー!G12=\"\",\"\",INDEX(競技者!$A$2:$A$81,MATCH(リレー!N12,競技者!$M$2:$M$81,0)))","v":""},{"$f":"IF(リレー!H12=\"\",\"\",INDEX(競技者!$A$2:$A$81,MATCH(リレー!O12,競技者!$M$2:$M$81,0)))","v":""},{"$f":"IF(リレー!I12=\"\",\"\",INDEX(競技者!$A$2:$A$81,MATCH(リレー!P12,競技者!$M$2:$M$81,0)))","v":""}]
[{"$f":"IF(リレー!A13=\"\",\"\",リレー!A13)","v":""},{"$f":"IF(リレー!A13=\"\",\"\",申込一覧!$F$11)&IF(リレー!B13=\"\",\"\",リレー!B13)","v":""},null,{"$f":"IF(リレー!A13=\"\",\"\",申込一覧!$F$11)&IF(リレー!B13=\"\",\"\",リレー!B13)","v":""},null,{"$f":"IF(リレー!C13=\"\",\"\",リレー!C13)","v":""},{"$f":"IF(リレー!D13=\"\",\"\",INDEX(競技者!$A$2:$A$81,MATCH(リレー!K13,競技者!$M$2:$M$81,0)))","v":""},{"$f":"IF(リレー!E13=\"\",\"\",INDEX(競技者!$A$2:$A$81,MATCH(リレー!L13,競技者!$M$2:$M$81,0)))","v":""},{"$f":"IF(リレー!F13=\"\",\"\",INDEX(競技者!$A$2:$A$81,MATCH(リレー!M13,競技者!$M$2:$M$81,0)))","v":""},{"$f":"IF(リレー!G13=\"\",\"\",INDEX(競技者!$A$2:$A$81,MATCH(リレー!N13,競技者!$M$2:$M$81,0)))","v":""},{"$f":"IF(リレー!H13=\"\",\"\",INDEX(競技者!$A$2:$A$81,MATCH(リレー!O13,競技者!$M$2:$M$81,0)))","v":""},{"$f":"IF(リレー!I13=\"\",\"\",INDEX(競技者!$A$2:$A$81,MATCH(リレー!P13,競技者!$M$2:$M$81,0)))","v":""}]
[{"$f":"IF(リレー!A14=\"\",\"\",リレー!A14)","v":""},{"$f":"IF(リレー!A14=\"\",\"\",申込一覧!$F$11)&IF(リレー!B14=\"\",\"\",リレー!B14)","v":""},null,{"$f":"IF(リレー!A14=\"\",\"\",申込一覧!$F$11)&IF(リレー!B14=\"\",\"\",リレー!B14)","v":""},null,{"$f":"IF(リレー!C14=\"\",\"\",リレー!C14)","v":""},{"$f":"IF(リレー!D14=\"\",\"\",INDEX(競技者!$A$2:$A$81,MATCH(リレー!K14,競技者!$M$2:$M$81,0)))","v":""},{"$f":"IF(リレー!E14=\"\",\"\",INDEX(競技者!$A$2:$A$81,MATCH(リレー!L14,競技者!$M$2:$M$81,0)))","v":""},{"$f":"IF(リレー!F14=\"\",\"\",INDEX(競技者!$A$2:$A$81,MATCH(リレー!M14,競技者!$M$2:$M$81,0)))","v":""},{"$f":"IF(リレー!G14=\"\",\"\",INDEX(競技者!$A$2:$A$81,MATCH(リレー!N14,競技者!$M$2:$M$81,0)))","v":""},{"$f":"IF(リレー!H14=\"\",\"\",INDEX(競技者!$A$2:$A$81,MATCH(リレー!O14,競技者!$M$2:$M$81,0)))","v":""},{"$f":"IF(リレー!I14=\"\",\"\",INDEX(競技者!$A$2:$A$81,MATCH(リレー!P14,競技者!$M$2:$M$81,0)))","v":""}]
[{"$f":"IF(リレー!A15=\"\",\"\",リレー!A15)","v":""},{"$f":"IF(リレー!A15=\"\",\"\",申込一覧!$F$11)&IF(リレー!B15=\"\",\"\",リレー!B15)","v":""},null,{"$f":"IF(リレー!A15=\"\",\"\",申込一覧!$F$11)&IF(リレー!B15=\"\",\"\",リレー!B15)","v":""},null,{"$f":"IF(リレー!C15=\"\",\"\",リレー!C15)","v":""},{"$f":"IF(リレー!D15=\"\",\"\",INDEX(競技者!$A$2:$A$81,MATCH(リレー!K15,競技者!$M$2:$M$81,0)))","v":""},{"$f":"IF(リレー!E15=\"\",\"\",INDEX(競技者!$A$2:$A$81,MATCH(リレー!L15,競技者!$M$2:$M$81,0)))","v":""},{"$f":"IF(リレー!F15=\"\",\"\",INDEX(競技者!$A$2:$A$81,MATCH(リレー!M15,競技者!$M$2:$M$81,0)))","v":""},{"$f":"IF(リレー!G15=\"\",\"\",INDEX(競技者!$A$2:$A$81,MATCH(リレー!N15,競技者!$M$2:$M$81,0)))","v":""},{"$f":"IF(リレー!H15=\"\",\"\",INDEX(競技者!$A$2:$A$81,MATCH(リレー!O15,競技者!$M$2:$M$81,0)))","v":""},{"$f":"IF(リレー!I15=\"\",\"\",INDEX(競技者!$A$2:$A$81,MATCH(リレー!P15,競技者!$M$2:$M$81,0)))","v":""}]
[{"$f":"IF(リレー!A16=\"\",\"\",リレー!A16)","v":""},{"$f":"IF(リレー!A16=\"\",\"\",申込一覧!$F$11)&IF(リレー!B16=\"\",\"\",リレー!B16)","v":""},null,{"$f":"IF(リレー!A16=\"\",\"\",申込一覧!$F$11)&IF(リレー!B16=\"\",\"\",リレー!B16)","v":""},null,{"$f":"IF(リレー!C16=\"\",\"\",リレー!C16)","v":""},{"$f":"IF(リレー!D16=\"\",\"\",INDEX(競技者!$A$2:$A$81,MATCH(リレー!K16,競技者!$M$2:$M$81,0)))","v":""},{"$f":"IF(リレー!E16=\"\",\"\",INDEX(競技者!$A$2:$A$81,MATCH(リレー!L16,競技者!$M$2:$M$81,0)))","v":""},{"$f":"IF(リレー!F16=\"\",\"\",INDEX(競技者!$A$2:$A$81,MATCH(リレー!M16,競技者!$M$2:$M$81,0)))","v":""},{"$f":"IF(リレー!G16=\"\",\"\",INDEX(競技者!$A$2:$A$81,MATCH(リレー!N16,競技者!$M$2:$M$81,0)))","v":""},{"$f":"IF(リレー!H16=\"\",\"\",INDEX(競技者!$A$2:$A$81,MATCH(リレー!O16,競技者!$M$2:$M$81,0)))","v":""},{"$f":"IF(リレー!I16=\"\",\"\",INDEX(競技者!$A$2:$A$81,MATCH(リレー!P16,競技者!$M$2:$M$81,0)))","v":""}]
[{"$f":"IF(リレー!A17=\"\",\"\",リレー!A17)","v":""},{"$f":"IF(リレー!A17=\"\",\"\",申込一覧!$F$11)&IF(リレー!B17=\"\",\"\",リレー!B17)","v":""},null,{"$f":"IF(リレー!A17=\"\",\"\",申込一覧!$F$11)&IF(リレー!B17=\"\",\"\",リレー!B17)","v":""},null,{"$f":"IF(リレー!C17=\"\",\"\",リレー!C17)","v":""},{"$f":"IF(リレー!D17=\"\",\"\",INDEX(競技者!$A$2:$A$81,MATCH(リレー!K17,競技者!$M$2:$M$81,0)))","v":""},{"$f":"IF(リレー!E17=\"\",\"\",INDEX(競技者!$A$2:$A$81,MATCH(リレー!L17,競技者!$M$2:$M$81,0)))","v":""},{"$f":"IF(リレー!F17=\"\",\"\",INDEX(競技者!$A$2:$A$81,MATCH(リレー!M17,競技者!$M$2:$M$81,0)))","v":""},{"$f":"IF(リレー!G17=\"\",\"\",INDEX(競技者!$A$2:$A$81,MATCH(リレー!N17,競技者!$M$2:$M$81,0)))","v":""},{"$f":"IF(リレー!H17=\"\",\"\",INDEX(競技者!$A$2:$A$81,MATCH(リレー!O17,競技者!$M$2:$M$81,0)))","v":""},{"$f":"IF(リレー!I17=\"\",\"\",INDEX(競技者!$A$2:$A$81,MATCH(リレー!P17,競技者!$M$2:$M$81,0)))","v":""}]
[{"$f":"IF(リレー!A18=\"\",\"\",リレー!A18)","v":""},{"$f":"IF(リレー!A18=\"\",\"\",申込一覧!$F$11)&IF(リレー!B18=\"\",\"\",リレー!B18)","v":""},null,{"$f":"IF(リレー!A18=\"\",\"\",申込一覧!$F$11)&IF(リレー!B18=\"\",\"\",リレー!B18)","v":""},null,{"$f":"IF(リレー!C18=\"\",\"\",リレー!C18)","v":""},{"$f":"IF(リレー!D18=\"\",\"\",INDEX(競技者!$A$2:$A$81,MATCH(リレー!K18,競技者!$M$2:$M$81,0)))","v":""},{"$f":"IF(リレー!E18=\"\",\"\",INDEX(競技者!$A$2:$A$81,MATCH(リレー!L18,競技者!$M$2:$M$81,0)))","v":""},{"$f":"IF(リレー!F18=\"\",\"\",INDEX(競技者!$A$2:$A$81,MATCH(リレー!M18,競技者!$M$2:$M$81,0)))","v":""},{"$f":"IF(リレー!G18=\"\",\"\",INDEX(競技者!$A$2:$A$81,MATCH(リレー!N18,競技者!$M$2:$M$81,0)))","v":""},{"$f":"IF(リレー!H18=\"\",\"\",INDEX(競技者!$A$2:$A$81,MATCH(リレー!O18,競技者!$M$2:$M$81,0)))","v":""},{"$f":"IF(リレー!I18=\"\",\"\",INDEX(競技者!$A$2:$A$81,MATCH(リレー!P18,競技者!$M$2:$M$81,0)))","v":""}]
[{"$f":"IF(リレー!A19=\"\",\"\",リレー!A19)","v":""},{"$f":"IF(リレー!A19=\"\",\"\",申込一覧!$F$11)&IF(リレー!B19=\"\",\"\",リレー!B19)","v":""},null,{"$f":"IF(リレー!A19=\"\",\"\",申込一覧!$F$11)&IF(リレー!B19=\"\",\"\",リレー!B19)","v":""},null,{"$f":"IF(リレー!C19=\"\",\"\",リレー!C19)","v":""},{"$f":"IF(リレー!D19=\"\",\"\",INDEX(競技者!$A$2:$A$81,MATCH(リレー!K19,競技者!$M$2:$M$81,0)))","v":""},{"$f":"IF(リレー!E19=\"\",\"\",INDEX(競技者!$A$2:$A$81,MATCH(リレー!L19,競技者!$M$2:$M$81,0)))","v":""},{"$f":"IF(リレー!F19=\"\",\"\",INDEX(競技者!$A$2:$A$81,MATCH(リレー!M19,競技者!$M$2:$M$81,0)))","v":""},{"$f":"IF(リレー!G19=\"\",\"\",INDEX(競技者!$A$2:$A$81,MATCH(リレー!N19,競技者!$M$2:$M$81,0)))","v":""},{"$f":"IF(リレー!H19=\"\",\"\",INDEX(競技者!$A$2:$A$81,MATCH(リレー!O19,競技者!$M$2:$M$81,0)))","v":""},{"$f":"IF(リレー!I19=\"\",\"\",INDEX(競技者!$A$2:$A$81,MATCH(リレー!P19,競技者!$M$2:$M$81,0)))","v":""}]
[{"$f":"IF(リレー!A20=\"\",\"\",リレー!A20)","v":""},{"$f":"IF(リレー!A20=\"\",\"\",申込一覧!$F$11)&IF(リレー!B20=\"\",\"\",リレー!B20)","v":""},null,{"$f":"IF(リレー!A20=\"\",\"\",申込一覧!$F$11)&IF(リレー!B20=\"\",\"\",リレー!B20)","v":""},null,{"$f":"IF(リレー!C20=\"\",\"\",リレー!C20)","v":""},{"$f":"IF(リレー!D20=\"\",\"\",INDEX(競技者!$A$2:$A$81,MATCH(リレー!K20,競技者!$M$2:$M$81,0)))","v":""},{"$f":"IF(リレー!E20=\"\",\"\",INDEX(競技者!$A$2:$A$81,MATCH(リレー!L20,競技者!$M$2:$M$81,0)))","v":""},{"$f":"IF(リレー!F20=\"\",\"\",INDEX(競技者!$A$2:$A$81,MATCH(リレー!M20,競技者!$M$2:$M$81,0)))","v":""},{"$f":"IF(リレー!G20=\"\",\"\",INDEX(競技者!$A$2:$A$81,MATCH(リレー!N20,競技者!$M$2:$M$81,0)))","v":""},{"$f":"IF(リレー!H20=\"\",\"\",INDEX(競技者!$A$2:$A$81,MATCH(リレー!O20,競技者!$M$2:$M$81,0)))","v":""},{"$f":"IF(リレー!I20=\"\",\"\",INDEX(競技者!$A$2:$A$81,MATCH(リレー!P20,競技者!$M$2:$M$81,0)))","v":""}]
[{"$f":"IF(リレー!A21=\"\",\"\",リレー!A21)","v":""},{"$f":"IF(リレー!A21=\"\",\"\",申込一覧!$F$11)&IF(リレー!B21=\"\",\"\",リレー!B21)","v":""},null,{"$f":"IF(リレー!A21=\"\",\"\",申込一覧!$F$11)&IF(リレー!B21=\"\",\"\",リレー!B21)","v":""},null,{"$f":"IF(リレー!C21=\"\",\"\",リレー!C21)","v":""},{"$f":"IF(リレー!D21=\"\",\"\",INDEX(競技者!$A$2:$A$81,MATCH(リレー!K21,競技者!$M$2:$M$81,0)))","v":""},{"$f":"IF(リレー!E21=\"\",\"\",INDEX(競技者!$A$2:$A$81,MATCH(リレー!L21,競技者!$M$2:$M$81,0)))","v":""},{"$f":"IF(リレー!F21=\"\",\"\",INDEX(競技者!$A$2:$A$81,MATCH(リレー!M21,競技者!$M$2:$M$81,0)))","v":""},{"$f":"IF(リレー!G21=\"\",\"\",INDEX(競技者!$A$2:$A$81,MATCH(リレー!N21,競技者!$M$2:$M$81,0)))","v":""},{"$f":"IF(リレー!H21=\"\",\"\",INDEX(競技者!$A$2:$A$81,MATCH(リレー!O21,競技者!$M$2:$M$81,0)))","v":""},{"$f":"IF(リレー!I21=\"\",\"\",INDEX(競技者!$A$2:$A$81,MATCH(リレー!P21,競技者!$M$2:$M$81,0)))","v":""}]
[{"$f":"IF(リレー!A22=\"\",\"\",リレー!A22)","v":""},{"$f":"IF(リレー!A22=\"\",\"\",申込一覧!$F$11)&IF(リレー!B22=\"\",\"\",リレー!B22)","v":""},null,{"$f":"IF(リレー!A22=\"\",\"\",申込一覧!$F$11)&IF(リレー!B22=\"\",\"\",リレー!B22)","v":""},null,{"$f":"IF(リレー!C22=\"\",\"\",リレー!C22)","v":""},{"$f":"IF(リレー!D22=\"\",\"\",INDEX(競技者!$A$2:$A$81,MATCH(リレー!K22,競技者!$M$2:$M$81,0)))","v":""},{"$f":"IF(リレー!E22=\"\",\"\",INDEX(競技者!$A$2:$A$81,MATCH(リレー!L22,競技者!$M$2:$M$81,0)))","v":""},{"$f":"IF(リレー!F22=\"\",\"\",INDEX(競技者!$A$2:$A$81,MATCH(リレー!M22,競技者!$M$2:$M$81,0)))","v":""},{"$f":"IF(リレー!G22=\"\",\"\",INDEX(競技者!$A$2:$A$81,MATCH(リレー!N22,競技者!$M$2:$M$81,0)))","v":""},{"$f":"IF(リレー!H22=\"\",\"\",INDEX(競技者!$A$2:$A$81,MATCH(リレー!O22,競技者!$M$2:$M$81,0)))","v":""},{"$f":"IF(リレー!I22=\"\",\"\",INDEX(競技者!$A$2:$A$81,MATCH(リレー!P22,競技者!$M$2:$M$81,0)))","v":""}]
[{"$f":"IF(リレー!A23=\"\",\"\",リレー!A23)","v":""},{"$f":"IF(リレー!A23=\"\",\"\",申込一覧!$F$11)&IF(リレー!B23=\"\",\"\",リレー!B23)","v":""},null,{"$f":"IF(リレー!A23=\"\",\"\",申込一覧!$F$11)&IF(リレー!B23=\"\",\"\",リレー!B23)","v":""},null,{"$f":"IF(リレー!C23=\"\",\"\",リレー!C23)","v":""},{"$f":"IF(リレー!D23=\"\",\"\",INDEX(競技者!$A$2:$A$81,MATCH(リレー!K23,競技者!$M$2:$M$81,0)))","v":""},{"$f":"IF(リレー!E23=\"\",\"\",INDEX(競技者!$A$2:$A$81,MATCH(リレー!L23,競技者!$M$2:$M$81,0)))","v":""},{"$f":"IF(リレー!F23=\"\",\"\",INDEX(競技者!$A$2:$A$81,MATCH(リレー!M23,競技者!$M$2:$M$81,0)))","v":""},{"$f":"IF(リレー!G23=\"\",\"\",INDEX(競技者!$A$2:$A$81,MATCH(リレー!N23,競技者!$M$2:$M$81,0)))","v":""},{"$f":"IF(リレー!H23=\"\",\"\",INDEX(競技者!$A$2:$A$81,MATCH(リレー!O23,競技者!$M$2:$M$81,0)))","v":""},{"$f":"IF(リレー!I23=\"\",\"\",INDEX(競技者!$A$2:$A$81,MATCH(リレー!P23,競技者!$M$2:$M$81,0)))","v":""}]
[{"$f":"IF(リレー!A24=\"\",\"\",リレー!A24)","v":""},{"$f":"IF(リレー!A24=\"\",\"\",申込一覧!$F$11)&IF(リレー!B24=\"\",\"\",リレー!B24)","v":""},null,{"$f":"IF(リレー!A24=\"\",\"\",申込一覧!$F$11)&IF(リレー!B24=\"\",\"\",リレー!B24)","v":""},null,{"$f":"IF(リレー!C24=\"\",\"\",リレー!C24)","v":""},{"$f":"IF(リレー!D24=\"\",\"\",INDEX(競技者!$A$2:$A$81,MATCH(リレー!K24,競技者!$M$2:$M$81,0)))","v":""},{"$f":"IF(リレー!E24=\"\",\"\",INDEX(競技者!$A$2:$A$81,MATCH(リレー!L24,競技者!$M$2:$M$81,0)))","v":""},{"$f":"IF(リレー!F24=\"\",\"\",INDEX(競技者!$A$2:$A$81,MATCH(リレー!M24,競技者!$M$2:$M$81,0)))","v":""},{"$f":"IF(リレー!G24=\"\",\"\",INDEX(競技者!$A$2:$A$81,MATCH(リレー!N24,競技者!$M$2:$M$81,0)))","v":""},{"$f":"IF(リレー!H24=\"\",\"\",INDEX(競技者!$A$2:$A$81,MATCH(リレー!O24,競技者!$M$2:$M$81,0)))","v":""},{"$f":"IF(リレー!I24=\"\",\"\",INDEX(競技者!$A$2:$A$81,MATCH(リレー!P24,競技者!$M$2:$M$81,0)))","v":""}]
{"$rows_left_out":16}
{"sheet":"競技者","index":5,"n_rows":2,"n_cols":13,"rows_kept":2,"cut":false,"hidden":true,"merged":[]}
["DB","N1","N2","SX","KC","MC","TL","WT","ZK","S1","S2","S3"]
[{"$f":"IF(申込一覧!B20=\"\",\"\",申込一覧!F20*10000+申込一覧!B20&申込一覧!$N$13&E2)","v":""},{"$f":"IF(申込一覧!C20=\"\",\"\",申込一覧!C20&IF(申込一覧!E20=\"\",\"\",\"(\"&申込一覧!E20&\")\"))","v":""},{"$f":"IF(申込一覧!D20=\"\",\"\",申込一覧!D20)","v":""},{"$f":"IF(申込一覧!F20=\"\",\"\",申込一覧!F20)","v":""},{"$f":"IF(申込一覧!B20=\"\",\"\",INDEX(RIGHTB(名前!$Y$4:$Y$53,2),MATCH(申込一覧!H20,県名_個人,0)))","v":""},{"$f":"IF(申込一覧!B20=\"\",\"\",申込一覧!$F$11)","v":""},{"$f":"IF(申込一覧!B20=\"\",\"\",0)","v":""},{"$f":"IF(申込一覧!B20=\"\",\"\",0)","v":""},{"$f":"IF(申込一覧!B20=\"\",\"\",申込一覧!B20)","v":""},{"$f":"IF(申込一覧!I20=\"\",\"\",INDEX(名前!$U$4:$U$69,MATCH(申込一覧!I20,名前!$V$4:$V$69,0))&\" \"&IF(申込一覧!P20=1,RIGHTB(10000000+申込一覧!J20,7),RIGHTB(100000+申込一覧!J20,5)))","v":""},{"$f":"IF(申込一覧!K20=\"\",\"\",INDEX(名前!$U$4:$U$69,MATCH(申込一覧!K20,名前!$V$4:$V$69,0))&\" \"&IF(申込一覧!Q20=1,RIGHTB(10000000+申込一覧!L20,7),RIGHTB(100000+申込一覧!L20,5)))","v":""},{"$f":"IF(申込一覧!M20=\"\",\"\",INDEX(名前!$U$4:$U$69,MATCH(申込一覧!M20,名前!$V$4:$V$69,0))&\" \"&IF(申込一覧!R20=1,RIGHTB(10000000+申込一覧!N20,7),RIGHTB(100000+申込一覧!N20,5)))","v":""},{"$f":"IF(申込一覧!B20=\"\",\"\",申込一覧!F20*10000+申込一覧!B20)","v":""}]

{"sheet":"参加料","index":6,"n_rows":13,"n_cols":14,"rows_kept":13,"cut":false,"hidden":true,"merged":[[0,11,1,11],[0,12,1,12],[0,13,1,13],[0,0,1,0],[0,1,1,2],[0,3,0,4],[0,5,0,6],[0,7,0,8],[0,9,0,10]]}
["団　体　名（個人名）","種別",null,"参加人数",null,"男子種目数",null,"女子種目数",null,"種目数計",null,"金額合計","摘要","P配布数"]
[null,null,null,"男子","女子","種目数","リレー","種目数","リレー","個人種目","リレー"]
[{"$f":"申込一覧!F11","v":0},{"$f":"申込一覧!K11","v":0},{"$f":"INDEX($B$6:$B$13,MATCH(申込一覧!O13,$C$6:$C$13,0))","v":{"$error":"#N/A"}},{"$f":"申込一覧!D14","v":0},{"$f":"申込一覧!G14","v":0},{"$f":"申込一覧!D15","v":0},{"$f":"申込一覧!D16","v":0},{"$f":"申込一覧!G15","v":0},{"$f":"申込一覧!G16","v":0},{"$f":"F3+H3","v":0},{"$f":"G3+I3","v":0},{"$f":"申込一覧!I17","v":0},{"$f":"IF(申込一覧!$C$11=\"徳　島\",\"\",\"県外\")","v":"県外"},{"$f":"IF(L3=\"\",\"\",INT(L3/5000))","v":0}]
[]
[]
[null,1,"KN小"]
[null,2,"KN中"]
[null,3,"KN高"]
[null,4,"KN一"]
[null,5,"KG小"]
[null,6,"KG中"]
[null,7,"KG高"]
[null,8,"KG一"]

{"sheet":"名前","index":7,"n_rows":67,"n_cols":26,"rows_kept":67,"cut":false,"hidden":true,"merged":[[26,4,30,4],[31,4,35,4]]}
[]
[]
["NO","都道府県名",null,"性別",null,null,1,null,null,"一般男子",null,null,"高校男子",null,null,"中学男子",null,null,"小学男子",null,null,null,null,null,"NO","都道府県名"]
[null,null,null,1,null,null,null,null,null,null,null,null,null,null,null,null,null,null,null,null,"00210","一男_100m",1]
[37,"徳　島",null,2,null,null,null,null,"00210","一男_1500m",null,"00210","高男_1500m",null,"00210","中男_1500m",null,"00270","小男_1000m",null,"00310","一男_200m",1,null,137,"徳島"]
[36,"香　川",null,null,null,null,null,null,"00310","一男_3000m",null,"00310","高男_3000m",null,"00310","中男_3000m",null,"00770",null,null,"00510","一男_400m",1,null,136,"香川"]
[38,"愛　媛",null,null,null,null,null,null,"00510","一男_5000m",null,"00510","高男_5000m",null,"00510",null,null,"04170",null,null,"00610","一男_800m",1,null,138,"愛媛"]
[39,"高　知",null,null,null,null,null,null,"00610",null,null,"00610",null,null,"00610",null,null,"07170",null,null,"03410","一男_110mH",1,null,139,"高知"]
[null,null,null,null,null,null,null,null,"03410",null,null,"03410",null,null,"03410",null,null,"07370",null,null,"03710","一男_400mH",1]
[1,"北海道",null,null,null,null,null,null,"03710",null,null,"03710",null,null,"03250",null,null,"09770",null,null,"07110","一男_走高跳",2,null,101,"北海道"]
[2,"青　森",null,null,null,null,null,null,"07110",null,null,"07110",null,null,"03710",null,null,null,null,null,"07210","一男_棒高跳",2,null,102,"青森"]
[3,"岩　手",null,null,null,null,null,null,"07210",null,null,"07210",null,null,"07110",null,null,null,null,null,"07310","一男_走幅跳",2,null,103,"岩手"]
[4,"宮　城",null,null,null,null,null,null,"07310",null,null,"07310",null,null,"07210",null,null,null,null,null,"07410","一男_三段跳",2,null,104,"宮城"]
[5,"秋　田",null,null,null,null,null,null,"07410",null,null,"07410",null,null,"07310",null,null,null,null,null,"08110","一男_砲丸投",2,null,105,"秋田"]
[6,"山　形",null,null,null,null,null,null,"08110",null,null,"08110",null,null,"07410",null,null,null,null,null,"08230","高男_砲丸投",2,null,106,"山形"]
{"$rows_left_out":53}
{"sheet":"Sheet1","index":8,"n_rows":0,"n_cols":0,"rows_kept":0,"cut":false,"hidden":true,"merged":[]}